APR

11

Sun

Author:EMINARCISSUS

被拍砖0次,接着砸!

reedsolomon.cpp:54: error: explicit specialization of ‘bool ReedSolomon<Galois<8u, 285u, unsigned char> >::SetInput(const std::vector<bool, std::allocator<bool> >&)’ must be introduced by ‘template <>’
reedsolomon.cpp:54: error: template-id ‘SetInput<>’ for ‘bool ReedSolomon<Galois<8u, 285u, unsigned char> >::SetInput(const std::vector<bool, std::allocator<bool> >&)’ does not match any template declaration
reedsolomon.cpp:54: error: invalid function declaration
reedsolomon.cpp:83: error: explicit specialization of ‘bool ReedSolomon<Galois<8u, 285u, unsigned char> >::SetInput(u32)’ must be introduced by ‘template <>’
reedsolomon.cpp:83: error: template-id ‘SetInput<>’ for ‘bool ReedSolomon<Galois<8u, 285u, unsigned char> >::SetInput(u32)’ does not match any template declaration
reedsolomon.cpp:83: error: invalid function declaration
reedsolomon.cpp:104: error: explicit specialization of ‘bool ReedSolomon<Galois<8u, 285u, unsigned char> >::Process(size_t, u32, const void*, u32, void*)’ must be introduced by ‘template <>’
reedsolomon.cpp:104: error: template-id ‘Process<>’ for ‘bool ReedSolomon<Galois<8u, 285u, unsigned char> >::Process(size_t, u32, const void*, u32, void*)’ does not match any template declaration
reedsolomon.cpp:104: error: invalid function declaration
reedsolomon.cpp:192: error: explicit specialization of ‘bool ReedSolomon<Galois<16u, 69643u, short unsigned int> >::SetInput(const std::vector<bool, std::allocator<bool> >&)’ must be introduced by ‘template <>’
reedsolomon.cpp:192: error: template-id ‘SetInput<>’ for ‘bool ReedSolomon<Galois<16u, 69643u, short unsigned int> >::SetInput(const std::vector<bool, std::allocator<bool> >&)’ does not match any template declaration
reedsolomon.cpp:192: error: invalid function declaration
reedsolomon.cpp:236: error: explicit specialization of ‘bool ReedSolomon<Galois<16u, 69643u, short unsigned int> >::SetInput(u32)’ must be introduced by ‘template <>’
reedsolomon.cpp:236: error: template-id ‘SetInput<>’ for ‘bool ReedSolomon<Galois<16u, 69643u, short unsigned int> >::SetInput(u32)’ does not match any template declaration
reedsolomon.cpp:236: error: invalid function declaration
reedsolomon.cpp:270: error: explicit specialization of ‘bool ReedSolomon<Galois<16u, 69643u, short unsigned int> >::Process(size_t, u32, const void*, u32, void*)’ must be introduced by ‘template <>’
reedsolomon.cpp:270: error: template-id ‘Process<>’ for ‘bool ReedSolomon<Galois<16u, 69643u, short unsigned int> >::Process(size_t, u32, const void*, u32, void*)’ does not match any template declaration
reedsolomon.cpp:270: error: invalid function declaration
make[1]: *** [reedsolomon.o] Error 1
make[1]: Leaving directory `/tmp/par2cmdline-0.4'
make: *** [all] Error 2

Tags:

归档:Technology

相关文章
smiley